Reaction Details
TargetEpidermal growth factor receptor
LigandBDBM50191664
Substrate/Competitorn/a
Meas. Tech.ChEMBL_1613063 (CHEMBL3854863)
IC50 12±n/a nM
Citation Smaill, JBGonzales, AJSpicer, JALee, HReed, JESexton, KAlthaus, IWZhu, TBlack, SLBlaser, ADenny, WAEllis, PAFakhoury, SHarvey, PJHook, KMcCarthy, FOPalmer, BDRivault, FSchlosser, KEllis, TThompson, AMTrachet, EWinters, RTTecle, HBridges, A Tyrosine Kinase Inhibitors. 20. Optimization of Substituted Quinazoline and Pyrido[3,4-d]pyrimidine Derivatives as Orally Active, Irreversible Inhibitors of the Epidermal Growth Factor Receptor Family. J Med Chem59:8103-24 (2016) 
 
Epidermal growth factor receptor
Name:Epidermal growth factor receptor
Type:Receptor Kinase Domain
Mol. Mass.:134279.59
Organism:Homo sapiens (Human)
Description:P00533
Residue:1210
BDBM50191664
NameBDBM50191664
Synonyms:CHEMBL3958006
TypeSmall organic molecule
Emp. Form.C21H20ClFN6O2
Mol. Mass.442.874
SMILESFc1ccc(Nc2ncnc3cnc(NC(=O)\C=C\CN4CCOCC4)cc23)cc1Cl