Reaction Details
TargetMitogen-activated protein kinase kinase kinase 8
LigandBDBM50191770
Substrate/Competitorn/a
Meas. Tech.ChEMBL_1613130 (CHEMBL3854930)
IC50 4.0±n/a nM
Citation Glatthar, RStojanovic, ATroxler, TMattes, HMöbitz, HBeerli, RBlanz, JGassmann, EDrückes, PFendrich, GGutmann, SMartiny-Baron, GSpence, FHornfeld, JPeel, JESparrer, H Discovery of Imidazoquinolines as a Novel Class of Potent, Selective, and in Vivo Efficacious Cancer Osaka Thyroid (COT) Kinase Inhibitors. J Med Chem59:7544-60 (2016) 
 
Mitogen-activated protein kinase kinase kinase 8
Name:Mitogen-activated protein kinase kinase kinase 8
Type:Serine/threonine-protein kinase
Mol. Mass.:52916.89
Organism:Homo sapiens (Human)
Description:P41279
Residue:467
BDBM50191770
NameBDBM50191770
Synonyms:CHEMBL3912476
TypeSmall organic molecule
Emp. Form.C30H28N8O
Mol. Mass.516.5963
SMILESC[C@H](CN1CCOCC1)Nc1ccc2cc(ccc2n1)-n1cnc2cnc3cnc(cc3c12)-c1ccncc1