Reaction Details
TargetMitogen-activated protein kinase kinase kinase 8
LigandBDBM50191769
Substrate/Competitorn/a
Meas. Tech.ChEMBL_1613130 (CHEMBL3854930)
IC50 9.0±n/a nM
Citation Glatthar, RStojanovic, ATroxler, TMattes, HMöbitz, HBeerli, RBlanz, JGassmann, EDrückes, PFendrich, GGutmann, SMartiny-Baron, GSpence, FHornfeld, JPeel, JESparrer, H Discovery of Imidazoquinolines as a Novel Class of Potent, Selective, and in Vivo Efficacious Cancer Osaka Thyroid (COT) Kinase Inhibitors. J Med Chem59:7544-60 (2016) 
 
Mitogen-activated protein kinase kinase kinase 8
Name:Mitogen-activated protein kinase kinase kinase 8
Type:Serine/threonine-protein kinase
Mol. Mass.:52916.89
Organism:Homo sapiens (Human)
Description:P41279
Residue:467
BDBM50191769
NameBDBM50191769
Synonyms:CHEMBL3927501
TypeSmall organic molecule
Emp. Form.C29H27N7OS
Mol. Mass.521.636
SMILESCC(CN1CCOCC1)Nc1nc2ccc(cc2s1)-n1cnc2cnc3cnc(cc3c12)-c1ccccc1