Reaction Details
TargetMitogen-activated protein kinase kinase kinase 8
LigandBDBM104963
Substrate/Competitorn/a
Meas. Tech.ChEMBL_1613130 (CHEMBL3854930)
IC50>25000±n/a nM
Citation Glatthar, RStojanovic, ATroxler, TMattes, HMöbitz, HBeerli, RBlanz, JGassmann, EDrückes, PFendrich, GGutmann, SMartiny-Baron, GSpence, FHornfeld, JPeel, JESparrer, H Discovery of Imidazoquinolines as a Novel Class of Potent, Selective, and in Vivo Efficacious Cancer Osaka Thyroid (COT) Kinase Inhibitors. J Med Chem59:7544-60 (2016) 
 
Mitogen-activated protein kinase kinase kinase 8
Name:Mitogen-activated protein kinase kinase kinase 8
Type:Serine/threonine-protein kinase
Mol. Mass.:52916.89
Organism:Homo sapiens (Human)
Description:P41279
Residue:467
BDBM104963
NameBDBM104963
Synonyms:CHEMBL507361 US11701360, PD0325901 US8575391, Q
TypeSmall organic molecule
Emp. Form.C16H14F3IN2O4
Mol. Mass.482.193
SMILESOC[C@@H](O)CONC(=O)c1ccc(F)c(F)c1Nc1ccc(I)cc1F