Reaction Details
TargetMitogen-activated protein kinase kinase kinase 8
LigandBDBM50191677
Substrate/Competitorn/a
Meas. Tech.ChEMBL_1613130 (CHEMBL3854930)
IC50 20±n/a nM
Citation Glatthar, RStojanovic, ATroxler, TMattes, HMöbitz, HBeerli, RBlanz, JGassmann, EDrückes, PFendrich, GGutmann, SMartiny-Baron, GSpence, FHornfeld, JPeel, JESparrer, H Discovery of Imidazoquinolines as a Novel Class of Potent, Selective, and in Vivo Efficacious Cancer Osaka Thyroid (COT) Kinase Inhibitors. J Med Chem59:7544-60 (2016) 
 
Mitogen-activated protein kinase kinase kinase 8
Name:Mitogen-activated protein kinase kinase kinase 8
Type:Serine/threonine-protein kinase
Mol. Mass.:52916.89
Organism:Homo sapiens (Human)
Description:P41279
Residue:467
BDBM50191677
NameBDBM50191677
Synonyms:CHEMBL3910848
TypeSmall organic molecule
Emp. Form.C22H13N5S
Mol. Mass.379.437
SMILESc1cc(cs1)-c1cc2c3n(cnc3cnc2cn1)-c1ccc2ncccc2c1