Reaction Details
TargetMitogen-activated protein kinase kinase kinase 8
LigandBDBM50191781
Substrate/Competitorn/a
Meas. Tech.ChEMBL_1613130 (CHEMBL3854930)
IC50 1300±n/a nM
Citation Glatthar, RStojanovic, ATroxler, TMattes, HMöbitz, HBeerli, RBlanz, JGassmann, EDrückes, PFendrich, GGutmann, SMartiny-Baron, GSpence, FHornfeld, JPeel, JESparrer, H Discovery of Imidazoquinolines as a Novel Class of Potent, Selective, and in Vivo Efficacious Cancer Osaka Thyroid (COT) Kinase Inhibitors. J Med Chem59:7544-60 (2016) 
 
Mitogen-activated protein kinase kinase kinase 8
Name:Mitogen-activated protein kinase kinase kinase 8
Type:Serine/threonine-protein kinase
Mol. Mass.:52916.89
Organism:Homo sapiens (Human)
Description:P41279
Residue:467
BDBM50191781
NameBDBM50191781
Synonyms:CHEMBL3911325
TypeSmall organic molecule
Emp. Form.C22H18N6
Mol. Mass.366.4185
SMILESC1CCC(=CC1)c1cc2c3n(cnc3cnc2cn1)-c1ccc2nc[nH]c2c1