Reaction Details
TargetMitogen-activated protein kinase kinase kinase 8
LigandBDBM50191784
Substrate/Competitorn/a
Meas. Tech.ChEMBL_1613130 (CHEMBL3854930)
IC50 90±n/a nM
Citation Glatthar, RStojanovic, ATroxler, TMattes, HMöbitz, HBeerli, RBlanz, JGassmann, EDrückes, PFendrich, GGutmann, SMartiny-Baron, GSpence, FHornfeld, JPeel, JESparrer, H Discovery of Imidazoquinolines as a Novel Class of Potent, Selective, and in Vivo Efficacious Cancer Osaka Thyroid (COT) Kinase Inhibitors. J Med Chem59:7544-60 (2016) 
 
Mitogen-activated protein kinase kinase kinase 8
Name:Mitogen-activated protein kinase kinase kinase 8
Type:Serine/threonine-protein kinase
Mol. Mass.:52916.89
Organism:Homo sapiens (Human)
Description:P41279
Residue:467
BDBM50191784
NameBDBM50191784
Synonyms:CHEMBL3919207
TypeSmall organic molecule
Emp. Form.C22H14N6
Mol. Mass.362.3868
SMILESc1nc2ccc(cc2[nH]1)-n1cnc2cnc3cnc(cc3c12)-c1ccccc1