Reaction Details
TargetPlatelet-derived growth factor receptor beta
LigandBDBM50191946
Substrate/Competitorn/a
Meas. Tech.ChEMBL_1613238 (CHEMBL3855038)
IC50 7.9±n/a nM
Citation Shaw, DEBaig, FBruce, IChamoin, SCollingwood, SPCross, SDayal, SDrückes, PFuret, PFurminger, VHaggart, DHussey, MKonstantinova, ILoren, JCMolteni, VRoberts, SReilly, JSaunders, AMStringer, RSviridenko, LThomas, MThomson, CGTomlins, CWen, BYeh, VPearce, AC Optimization of Platelet-Derived Growth Factor Receptor (PDGFR) Inhibitors for Duration of Action, as an Inhaled Therapy for Lung Remodeling in Pulmonary Arterial Hypertension. J Med Chem59:7901-14 (2016) 
 
Platelet-derived growth factor receptor beta
Name:Platelet-derived growth factor receptor beta
Type:PROTEIN
Mol. Mass.:122794.58
Organism:Rattus norvegicus
Description:ChEMBL_177425
Residue:1097
BDBM50191946
NameBDBM50191946
Synonyms:CHEMBL3950278
TypeSmall organic molecule
Emp. Form.C32H30FN7O2
Mol. Mass.563.6247
SMILESCN1CCN(CC1)c1ccccc1CNC(=O)c1ccc(F)c(NC(=O)c2cnc3cc(ccn23)-c2cccnc2)c1