Reaction Details
TargetPlatelet-derived growth factor receptor alpha
LigandBDBM50191973
Substrate/Competitorn/a
Meas. Tech.ChEMBL_1613237 (CHEMBL3855037)
IC50 0.190000±n/a nM
Citation Shaw, DEBaig, FBruce, IChamoin, SCollingwood, SPCross, SDayal, SDrückes, PFuret, PFurminger, VHaggart, DHussey, MKonstantinova, ILoren, JCMolteni, VRoberts, SReilly, JSaunders, AMStringer, RSviridenko, LThomas, MThomson, CGTomlins, CWen, BYeh, VPearce, AC Optimization of Platelet-Derived Growth Factor Receptor (PDGFR) Inhibitors for Duration of Action, as an Inhaled Therapy for Lung Remodeling in Pulmonary Arterial Hypertension. J Med Chem59:7901-14 (2016) 
 
Platelet-derived growth factor receptor alpha
Name:Platelet-derived growth factor receptor alpha
Type:Protein
Mol. Mass.:122633.38
Organism:Homo sapiens (Human)
Description:P16234
Residue:1089
BDBM50191973
NameBDBM50191973
Synonyms:CHEMBL3940697
TypeSmall organic molecule
Emp. Form.C27H30FN7O2
Mol. Mass.503.5712
SMILESCn1cc(cn1)-c1ccn2c(cnc2c1)C(=O)Nc1cc(ccc1F)C(=O)NCCN1CCCC1(C)C