Reaction Details
TargetPlatelet-derived growth factor receptor beta
LigandBDBM50191975
Substrate/Competitorn/a
Meas. Tech.ChEMBL_1613238 (CHEMBL3855038)
IC50 2.7±n/a nM
Citation Shaw, DEBaig, FBruce, IChamoin, SCollingwood, SPCross, SDayal, SDrückes, PFuret, PFurminger, VHaggart, DHussey, MKonstantinova, ILoren, JCMolteni, VRoberts, SReilly, JSaunders, AMStringer, RSviridenko, LThomas, MThomson, CGTomlins, CWen, BYeh, VPearce, AC Optimization of Platelet-Derived Growth Factor Receptor (PDGFR) Inhibitors for Duration of Action, as an Inhaled Therapy for Lung Remodeling in Pulmonary Arterial Hypertension. J Med Chem59:7901-14 (2016) 
 
Platelet-derived growth factor receptor beta
Name:Platelet-derived growth factor receptor beta
Type:PROTEIN
Mol. Mass.:122794.58
Organism:Rattus norvegicus
Description:ChEMBL_177425
Residue:1097
BDBM50191975
NameBDBM50191975
Synonyms:CHEMBL3975580
TypeSmall organic molecule
Emp. Form.C26H27FN6O3
Mol. Mass.490.5294
SMILESCn1nccc1-c1ccn2c(cnc2c1)C(=O)Nc1cc(ccc1F)C(=O)NCC1CCC(C)(C)O1