Reaction Details
TargetPlatelet-derived growth factor receptor alpha
LigandBDBM50191977
Substrate/Competitorn/a
Meas. Tech.ChEMBL_1613237 (CHEMBL3855037)
IC50<0.100000±n/a nM
Citation Shaw, DEBaig, FBruce, IChamoin, SCollingwood, SPCross, SDayal, SDrückes, PFuret, PFurminger, VHaggart, DHussey, MKonstantinova, ILoren, JCMolteni, VRoberts, SReilly, JSaunders, AMStringer, RSviridenko, LThomas, MThomson, CGTomlins, CWen, BYeh, VPearce, AC Optimization of Platelet-Derived Growth Factor Receptor (PDGFR) Inhibitors for Duration of Action, as an Inhaled Therapy for Lung Remodeling in Pulmonary Arterial Hypertension. J Med Chem59:7901-14 (2016) 
 
Platelet-derived growth factor receptor alpha
Name:Platelet-derived growth factor receptor alpha
Type:Protein
Mol. Mass.:122633.38
Organism:Homo sapiens (Human)
Description:P16234
Residue:1089
BDBM50191977
NameBDBM50191977
Synonyms:CHEMBL3983564
TypeSmall organic molecule
Emp. Form.C30H29FN8O2
Mol. Mass.552.6021
SMILESCN1CCN(CC1)c1ccccc1CNC(=O)c1ccc(F)c(NC(=O)c2cnc3cc(ccn23)-c2cc[nH]n2)c1