Reaction Details
TargetPlatelet-derived growth factor receptor alpha
LigandBDBM50191980
Substrate/Competitorn/a
Meas. Tech.ChEMBL_1613237 (CHEMBL3855037)
IC50 0.960000±n/a nM
Citation Shaw, DEBaig, FBruce, IChamoin, SCollingwood, SPCross, SDayal, SDrückes, PFuret, PFurminger, VHaggart, DHussey, MKonstantinova, ILoren, JCMolteni, VRoberts, SReilly, JSaunders, AMStringer, RSviridenko, LThomas, MThomson, CGTomlins, CWen, BYeh, VPearce, AC Optimization of Platelet-Derived Growth Factor Receptor (PDGFR) Inhibitors for Duration of Action, as an Inhaled Therapy for Lung Remodeling in Pulmonary Arterial Hypertension. J Med Chem59:7901-14 (2016) 
 
Platelet-derived growth factor receptor alpha
Name:Platelet-derived growth factor receptor alpha
Type:Protein
Mol. Mass.:122633.38
Organism:Homo sapiens (Human)
Description:P16234
Residue:1089
BDBM50191980
NameBDBM50191980
Synonyms:CHEMBL3985689
TypeSmall organic molecule
Emp. Form.C31H33N9O2
Mol. Mass.563.6528
SMILESCN1CCN(CC1)c1ccccc1CNC(=O)c1cnc(C)c(NC(=O)c2cnn3cc(ccc23)-c2ccnn2C)c1