Reaction Details
TargetPlatelet-derived growth factor receptor beta
LigandBDBM50192007
Substrate/Competitorn/a
Meas. Tech.ChEMBL_1613238 (CHEMBL3855038)
IC50 22±n/a nM
Citation Shaw, DEBaig, FBruce, IChamoin, SCollingwood, SPCross, SDayal, SDrückes, PFuret, PFurminger, VHaggart, DHussey, MKonstantinova, ILoren, JCMolteni, VRoberts, SReilly, JSaunders, AMStringer, RSviridenko, LThomas, MThomson, CGTomlins, CWen, BYeh, VPearce, AC Optimization of Platelet-Derived Growth Factor Receptor (PDGFR) Inhibitors for Duration of Action, as an Inhaled Therapy for Lung Remodeling in Pulmonary Arterial Hypertension. J Med Chem59:7901-14 (2016) 
 
Platelet-derived growth factor receptor beta
Name:Platelet-derived growth factor receptor beta
Type:PROTEIN
Mol. Mass.:122794.58
Organism:Rattus norvegicus
Description:ChEMBL_177425
Residue:1097
BDBM50192007
NameBDBM50192007
Synonyms:CHEMBL3902237
TypeSmall organic molecule
Emp. Form.C27H32FN7O2
Mol. Mass.505.5871
SMILESCCN(CCNC(=O)c1ccc(F)c(NC(=O)c2cnc3cc(ccn23)-c2ccnn2C)c1)C(C)(C)C