Reaction Details
TargetLeukocyte surface antigen CD47
LigandBDBM50192017
Substrate/Competitorn/a
Meas. Tech.ChEMBL_1613291 (CHEMBL3855091)
Kd 42000±n/a nM
Citation Denèfle, TBoullet, HHerbi, LNewton, CMartinez-Torres, ACGuez, APramil, EQuiney, CPourcelot, MLevasseur, MDLardé, EMoumné, ROgi, FXGrondin, PMerle-Beral, HLequin, OSusin, SAKaroyan, P Thrombospondin-1 Mimetic Agonist Peptides Induce Selective Death in Tumor Cells: Design, Synthesis, and Structure-Activity Relationship Studies. J Med Chem59:8412-21 (2016) 
 
Leukocyte surface antigen CD47
Name:Leukocyte surface antigen CD47
Type:PROTEIN
Mol. Mass.:35214.74
Organism:Homo sapiens (Human)
Description:ChEMBL_116544
Residue:323
BDBM50192017
NameBDBM50192017
Synonyms:CHEMBL3899400
TypeSmall organic molecule
Emp. Form.C66H101N17O12
Mol. Mass.1324.6148
SMILESCC(C)[C@H](NC(=O)[C@@H](NC(=O)[C@H](Cc1ccc(O)cc1)NC(=O)[C@H](Cc1ccccc1)NC(=O)[C@H](CCCNC(N)=N)NC(=O)[C@H](N)CCCCN)C(C)C)C(=O)N[C@@H](C)C(=O)N[C@@H](Cc1c[nH]c2ccccc12)C(=O)N[C@@H](CCCCN)C(=O)N[C@H](CCCCN)C(O)=O