Reaction Details
TargetD(3) dopamine receptor
LigandBDBM50192100
Substrate/Competitorn/a
Meas. Tech.ChEMBL_1613477 (CHEMBL3855277)
Ki 0.416869±n/a nM
Citation Micheli, FBacchi, ABraggio, SCastelletti, LCavallini, PCavanni, PCremonesi, SDal Cin, MFeriani, AGehanne, SKajbaf, MMarchió, LNola, SOliosi, BPellacani, APerdoną, ESava, ASemeraro, TTarsi, LTomelleri, SWong, AVisentini, FZonzini, LHeidbreder, C 1,2,4-Triazolyl 5-Azaspiro[2.4]heptanes: Lead Identification and Early Lead Optimization of a New Series of Potent and Selective Dopamine D3 Receptor Antagonists. J Med Chem59:8549-76 (2016) 
 
D(3) dopamine receptor
Name:D(3) dopamine receptor
Type:n/a
Mol. Mass.:44243.43
Organism:Homo sapiens (Human)
Description:n/a
Residue:400
BDBM50192100
NameBDBM50192100
Synonyms:CHEMBL3955505 | US10239870, Example 29
TypeSmall organic molecule
Emp. Form.C23H25F4N5OS
Mol. Mass.495.536
SMILESCc1ncoc1-c1nnc(SCCCN2CC[C@@]3(C[C@H]3c3ccc(cc3F)C(F)(F)F)C2)n1C