Reaction Details
TargetVoltage-dependent T-type calcium channel subunit alpha-1H
LigandBDBM50192663
Substrate/Competitorn/a
Meas. Tech.ChEBML_1613535
IC50 350±n/a nM
Citation Remen, LBezençon, OSimons, LGaston, RDowning, DGatfield, JRoch, CKessler, MMosbacher, JPfeifer, TGrisostomi, CRey, MErtel, EAMoon, R Preparation, Antiepileptic Activity, and Cardiovascular Safety of Dihydropyrazoles as Brain-Penetrant T-Type Calcium Channel Blockers. J Med Chem59:8398-411 (2016) 
 
Voltage-dependent T-type calcium channel subunit alpha-1H
Name:Voltage-dependent T-type calcium channel subunit alpha-1H
Type:Enzyme Catalytic Domain
Mol. Mass.:259187.68
Organism:Homo sapiens (Human)
Description:Calcium channel (Type T,L) 0 0::O95180
Residue:2353
BDBM50192663
NameBDBM50192663
Synonyms:CHEMBL3941425
TypeSmall organic molecule
Emp. Form.C25H24FN3O2
Mol. Mass.417.4754
SMILESCOCC1(CC(=NN1C(=O)Nc1ccc(F)cc1)c1ccccc1)c1ccc(C)cc1