Reaction Details
TargetVoltage-dependent L-type calcium channel subunit alpha-1C
LigandBDBM50192670
Substrate/Competitorn/a
Meas. Tech.ChEMBL_1613525 (CHEMBL3855325)
IC50>10000±n/a nM
Citation Remen, LBezençon, OSimons, LGaston, RDowning, DGatfield, JRoch, CKessler, MMosbacher, JPfeifer, TGrisostomi, CRey, MErtel, EAMoon, R Preparation, Antiepileptic Activity, and Cardiovascular Safety of Dihydropyrazoles as Brain-Penetrant T-Type Calcium Channel Blockers. J Med Chem59:8398-411 (2016) 
 
Voltage-dependent L-type calcium channel subunit alpha-1C
Name:Voltage-dependent L-type calcium channel subunit alpha-1C
Type:Enzyme Catalytic Domain
Mol. Mass.:248979.79
Organism:Homo sapiens (Human)
Description:Calcium channel (Type L) 0 HUMAN::Q13936
Residue:2221
BDBM50192670
NameBDBM50192670
Synonyms:CHEMBL3964030
TypeSmall organic molecule
Emp. Form.C23H20FN3O3S
Mol. Mass.437.487
SMILESCS(=O)(=O)c1ccc(cc1)C1CC(=NN1C(=O)Nc1ccc(F)cc1)c1ccccc1