Reaction Details
TargetVoltage-dependent T-type calcium channel subunit alpha-1H
LigandBDBM50192700
Substrate/Competitorn/a
Meas. Tech.ChEMBL_1613524 (CHEMBL3855324)
IC50 281±n/a nM
Citation Remen, LBezençon, OSimons, LGaston, RDowning, DGatfield, JRoch, CKessler, MMosbacher, JPfeifer, TGrisostomi, CRey, MErtel, EAMoon, R Preparation, Antiepileptic Activity, and Cardiovascular Safety of Dihydropyrazoles as Brain-Penetrant T-Type Calcium Channel Blockers. J Med Chem59:8398-411 (2016) 
 
Voltage-dependent T-type calcium channel subunit alpha-1H
Name:Voltage-dependent T-type calcium channel subunit alpha-1H
Type:Enzyme Catalytic Domain
Mol. Mass.:259187.68
Organism:Homo sapiens (Human)
Description:Calcium channel (Type T,L) 0 0::O95180
Residue:2353
BDBM50192700
NameBDBM50192700
Synonyms:CHEMBL3897833
TypeSmall organic molecule
Emp. Form.C22H16BrF2N3S
Mol. Mass.472.348
SMILESFc1ccc(NC(=S)N2N=C(CC2c2ccc(F)cc2)c2ccc(Br)cc2)cc1