Reaction Details
TargetVoltage-dependent T-type calcium channel subunit alpha-1H
LigandBDBM50192690
Substrate/Competitorn/a
Meas. Tech.ChEMBL_1613524 (CHEMBL3855324)
IC50 410±n/a nM
Citation Remen, LBezençon, OSimons, LGaston, RDowning, DGatfield, JRoch, CKessler, MMosbacher, JPfeifer, TGrisostomi, CRey, MErtel, EAMoon, R Preparation, Antiepileptic Activity, and Cardiovascular Safety of Dihydropyrazoles as Brain-Penetrant T-Type Calcium Channel Blockers. J Med Chem59:8398-411 (2016) 
 
Voltage-dependent T-type calcium channel subunit alpha-1H
Name:Voltage-dependent T-type calcium channel subunit alpha-1H
Type:Enzyme Catalytic Domain
Mol. Mass.:259187.68
Organism:Homo sapiens (Human)
Description:Calcium channel (Type T,L) 0 0::O95180
Residue:2353
BDBM50192690
NameBDBM50192690
Synonyms:CHEMBL3973610
TypeSmall organic molecule
Emp. Form.C17H16FN3O
Mol. Mass.297.3268
SMILESCC1CC(=NN1C(=O)Nc1ccc(F)cc1)c1ccccc1