Reaction Details
TargetCytochrome P450 3A4
LigandBDBM50192665
Substrate/Competitorn/a
Meas. Tech.ChEMBL_1613542 (CHEMBL3855342)
IC50 1800±n/a nM
Citation Remen, LBezençon, OSimons, LGaston, RDowning, DGatfield, JRoch, CKessler, MMosbacher, JPfeifer, TGrisostomi, CRey, MErtel, EAMoon, R Preparation, Antiepileptic Activity, and Cardiovascular Safety of Dihydropyrazoles as Brain-Penetrant T-Type Calcium Channel Blockers. J Med Chem59:8398-411 (2016) 
 
Cytochrome P450 3A4
Name:Cytochrome P450 3A4
Type:Enzyme
Mol. Mass.:57349.57
Organism:Homo sapiens (Human)
Description:n/a
Residue:503
BDBM50192665
NameBDBM50192665
Synonyms:CHEMBL3892579
TypeSmall organic molecule
Emp. Form.C21H16F2N4O
Mol. Mass.378.3747
SMILESFc1ccc(NC(=O)N2N=C(CC2c2ccc(F)cc2)c2ccncc2)cc1