Reaction Details
TargetOxysterols receptor LXR-beta
LigandBDBM50177015
Substrate/Competitorn/a
Meas. Tech.ChEMBL_1613606 (CHEMBL3855406)
Ki 3.0±n/a nM
Citation Tice, CMNoto, PBFan, KYZhao, WLotesta, SDDong, CMarcus, APZheng, YJChen, GWu, ZVan Orden, RZhou, JBukhtiyarov, YZhao, YLipinski, KHoward, LGuo, JKandpal, GMeng, SHardy, AKrosky, PGregg, RELeftheris, KMcKeever, BMSingh, SBLala, DMcGeehan, GMZhuang, LClaremon, DA Brain penetrant liver X receptor (LXR) modulators based on a 2,4,5,6-tetrahydropyrrolo[3,4-c]pyrazole core. Bioorg Med Chem Lett26:5044-5050 (2016) 
 
Oxysterols receptor LXR-beta
Name:Oxysterols receptor LXR-beta
Type:Enzyme Catalytic Domain
Mol. Mass.:50978.79
Organism:Homo sapiens (Human)
Description:P55055
Residue:460
BDBM50177015
NameBDBM50177015
Synonyms:CHEMBL3814206 | US10144715, Compound 19-1
TypeSmall organic molecule
Emp. Form.C21H27F3N4O4S
Mol. Mass.488.524
SMILESCC(C)[C@@H]1CN(CCN1c1ncc(CO)c(n1)C(F)(F)F)c1ccc(CO)c(c1)S(C)(=O)=O