Reaction Details
TargetOxysterols receptor LXR-beta
LigandBDBM50192753
Substrate/Competitorn/a
Meas. Tech.ChEMBL_1613608 (CHEMBL3855408)
EC50 18±n/a nM
Citation Tice, CMNoto, PBFan, KYZhao, WLotesta, SDDong, CMarcus, APZheng, YJChen, GWu, ZVan Orden, RZhou, JBukhtiyarov, YZhao, YLipinski, KHoward, LGuo, JKandpal, GMeng, SHardy, AKrosky, PGregg, RELeftheris, KMcKeever, BMSingh, SBLala, DMcGeehan, GMZhuang, LClaremon, DA Brain penetrant liver X receptor (LXR) modulators based on a 2,4,5,6-tetrahydropyrrolo[3,4-c]pyrazole core. Bioorg Med Chem Lett26:5044-5050 (2016) 
 
Oxysterols receptor LXR-beta
Name:Oxysterols receptor LXR-beta
Type:Enzyme Catalytic Domain
Mol. Mass.:50978.79
Organism:Homo sapiens (Human)
Description:P55055
Residue:460
BDBM50192753
NameBDBM50192753
Synonyms:CHEMBL3985591
TypeSmall organic molecule
Emp. Form.C21H22F3N5O2S
Mol. Mass.465.492
SMILESCC(C)[C@H]1N(Cc2cn(nc12)-c1cccc(c1)S(C)(=O)=O)c1cc(nc(C)n1)C(F)(F)F