Reaction Details
TargetOxysterols receptor LXR-beta
LigandBDBM50192751
Substrate/Competitorn/a
Meas. Tech.ChEMBL_1613606 (CHEMBL3855406)
Ki 26±n/a nM
Citation Tice, CMNoto, PBFan, KYZhao, WLotesta, SDDong, CMarcus, APZheng, YJChen, GWu, ZVan Orden, RZhou, JBukhtiyarov, YZhao, YLipinski, KHoward, LGuo, JKandpal, GMeng, SHardy, AKrosky, PGregg, RELeftheris, KMcKeever, BMSingh, SBLala, DMcGeehan, GMZhuang, LClaremon, DA Brain penetrant liver X receptor (LXR) modulators based on a 2,4,5,6-tetrahydropyrrolo[3,4-c]pyrazole core. Bioorg Med Chem Lett26:5044-5050 (2016) 
 
Oxysterols receptor LXR-beta
Name:Oxysterols receptor LXR-beta
Type:Enzyme Catalytic Domain
Mol. Mass.:50978.79
Organism:Homo sapiens (Human)
Description:P55055
Residue:460
BDBM50192751
NameBDBM50192751
Synonyms:CHEMBL3889601
TypeSmall organic molecule
Emp. Form.C22H24F3N5O4S
Mol. Mass.511.517
SMILESCC(C)C1N(Cc2cn(nc12)-c1ccc(CO)c(c1)S(C)(=O)=O)c1ncc(CO)c(n1)C(F)(F)F