Reaction Details
TargetProthrombin
LigandBDBM50192764
Substrate/Competitorn/a
Meas. Tech.ChEMBL_1613697 (CHEMBL3855497)
Ki 18000±n/a nM
Citation Ladziata, VUGlunz, PWZou, YZhang, XJiang, WJacutin-Porte, SCheney, DLWei, ALuettgen, JMHarper, TMWong, PCSeiffert, DWexler, RRPriestley, ES Synthesis and P1' SAR exploration of potent macrocyclic tissue factor-factor VIIa inhibitors. Bioorg Med Chem Lett26:5051-5057 (2016) 
 
Prothrombin
Name:Prothrombin
Type:Protein
Mol. Mass.:70029.57
Organism:Homo sapiens (Human)
Description:P00734
Residue:622
BDBM50192764
NameBDBM50192764
Synonyms:CHEMBL3934882
TypeSmall organic molecule
Emp. Form.C33H34FN5O3
Mol. Mass.567.6532
SMILESC[C@H]1COC(=O)Nc2ccc(C3CC3)c(CN(C)C(=O)[C@H](Nc3ccc4c(N)ncc(F)c4c3)c3ccc1c(C)c3)c2