Reaction Details
TargetTransient receptor potential cation channel subfamily V member 4
LigandBDBM50192809
Substrate/Competitorn/a
Meas. Tech.ChEMBL_1613866 (CHEMBL3855666)
IC50 0.400000±n/a nM
Citation Tsuno, NYukimasa, AYoshida, OSuzuki, SNakai, HOgawa, TFujiu, MTakaya, KNozu, AYamaguchi, HMatsuda, HFunaki, SNishimura, YIto, TNagamatsu, DAsaki, THorita, NYamamoto, MHinata, MSoga, MImai, MMorioka, YKanemasa, TSakaguchi, GIso, Y Discovery of novel 2',4'-dimethyl-[4,5'-bithiazol]-2-yl amino derivatives as orally bioavailable TRPV4 antagonists for the treatment of pain: Part 2. Bioorg Med Chem Lett26:4936-4941 (2016) 
 
Transient receptor potential cation channel subfamily V member 4
Name:Transient receptor potential cation channel subfamily V member 4
Type:Enzyme
Mol. Mass.:98290.10
Organism:Homo sapiens (Human)
Description:Q9HBA0
Residue:871
BDBM50192809
NameBDBM50192809
Synonyms:CHEMBL3941914
TypeSmall organic molecule
Emp. Form.C25H23F3N8OS2
Mol. Mass.572.628
SMILESCc1nc(C)c(s1)-c1csc(Nc2ccc(cn2)C(=O)N2C3CCC2CN(C3)c2ncc(cn2)C(F)(F)F)n1