Reaction Details
TargetPhosphatidylinositol 4,5-bisphosphate 3-kinase catalytic subunit gamma isoform
LigandBDBM50192882
Substrate/Competitorn/a
Meas. Tech.ChEMBL_1613926 (CHEMBL3855726)
IC50 25±n/a nM
Citation Evans, CALiu, TLescarbeau, ANair, SJGrenier, LPradeilles, JAGlenadel, QTibbitts, TRowley, AMDiNitto, JPBrophy, EEO'Hearn, ELAli, JAWinkler, DGGoldstein, SIO'Hearn, PMartin, CMHoyt, JGSoglia, JRCheung, CPink, MMProctor, JLPalombella, VJTremblay, MRCastro, AC Discovery of a Selective Phosphoinositide-3-Kinase (PI3K)-¿ Inhibitor (IPI-549) as an Immuno-Oncology Clinical Candidate. ACS Med Chem Lett7:862-7 (2016) 
 
Phosphatidylinositol 4,5-bisphosphate 3-kinase catalytic subunit gamma isoform
Name:Phosphatidylinositol 4,5-bisphosphate 3-kinase catalytic subunit gamma isoform
Type:Enzyme Subunit
Mol. Mass.:126470.30
Organism:Homo sapiens (Human)
Description:P48736
Residue:1102
BDBM50192882
NameBDBM50192882
Synonyms:CHEMBL3937119
TypeSmall organic molecule
Emp. Form.C27H22N6O2
Mol. Mass.462.5026
SMILESCC#Cc1cccc2cc([C@H](C)NC(=O)c3c(N)nn4cccnc34)n(-c3ccccc3)c(=O)c12