Reaction Details
TargetE3 ubiquitin-protein ligase SMURF1
LigandBDBM239094
Substrate/Competitorn/a
Meas. Tech.ChEBML_1614090
IC50 1.8±n/a nM
Citation Abdel-Magid, AF Therapeutic Potential of Smurf-1 Inhibitors for the Treatment of Pulmonary Arterial Hypertension (PAH). ACS Med Chem Lett7:878-880 (2016) 
 
E3 ubiquitin-protein ligase SMURF1
Name:E3 ubiquitin-protein ligase SMURF1
Type:PROTEIN
Mol. Mass.:86120.64
Organism:Homo sapiens (Human)
Description:ChEMBL_116984
Residue:757
BDBM239094
NameBDBM239094
Synonyms:US10195181, Example 1.3 | US9403810, 1.3
TypeSmall organic molecule
Emp. Form.C24H34N4O3
Mol. Mass.426.5518
SMILESCCC1CCC(=CC1)c1onc(C(=O)Nc2c(C)n(C)n(C3CCCCC3)c2=O)c1C