Reaction Details
TargetPhosphatidylinositol 4,5-bisphosphate 3-kinase catalytic subunit delta isoform
LigandBDBM50193012
Substrate/Competitorn/a
Meas. Tech.ChEBML_1614094
IC50 96±n/a nM
Citation Ferguson, FMNi, JZhang, TTesar, BSim, TKim, NDDeng, XBrown, JRZhao, JJGray, NS Discovery of a Series of 5,11-Dihydro-6 ACS Med Chem Lett7:908-912 (2016) 
 
Phosphatidylinositol 4,5-bisphosphate 3-kinase catalytic subunit delta isoform
Name:Phosphatidylinositol 4,5-bisphosphate 3-kinase catalytic subunit delta isoform
Type:Enzyme Subunit
Mol. Mass.:119489.41
Organism:Homo sapiens (Human)
Description:O00329
Residue:1044
BDBM50193012
NameBDBM50193012
Synonyms:CHEMBL3926951 | US11155556, No. 6
TypeSmall organic molecule
Emp. Form.C29H27N7O4S
Mol. Mass.569.634
SMILESCN1c2ccc(C)cc2C(=O)N(C)c2cnc(Nc3ccc(cc3)S(=O)(=O)Nc3ccc(NC(=O)C=C)cc3)nc12