Reaction Details
TargetAurora kinase A
LigandBDBM50193014
Substrate/Competitorn/a
Meas. Tech.ChEBML_1614096
IC50 110±n/a nM
Citation Ferguson, FMNi, JZhang, TTesar, BSim, TKim, NDDeng, XBrown, JRZhao, JJGray, NS Discovery of a Series of 5,11-Dihydro-6 ACS Med Chem Lett7:908-912 (2016) 
 
Aurora kinase A
Name:Aurora kinase A
Type:Serine/threonine-protein kinase
Mol. Mass.:45830.98
Organism:Homo sapiens (Human)
Description:O14965
Residue:403
BDBM50193014
NameBDBM50193014
Synonyms:CHEMBL3942643 | US11155556, No. 9
TypeSmall organic molecule
Emp. Form.C27H31N7O4S
Mol. Mass.549.645
SMILESCCC(=O)N1CCN(CC1)S(=O)(=O)c1cccc(Nc2ncc3N(C)C(=O)c4cc(C)ccc4N(C)c3n2)c1