Reaction Details
TargetPhosphatidylinositol 4,5-bisphosphate 3-kinase catalytic subunit gamma isoform
LigandBDBM50193017
Substrate/Competitorn/a
Meas. Tech.ChEBML_1614095
IC50 4.3±n/a nM
Citation Ferguson, FMNi, JZhang, TTesar, BSim, TKim, NDDeng, XBrown, JRZhao, JJGray, NS Discovery of a Series of 5,11-Dihydro-6 ACS Med Chem Lett7:908-912 (2016) 
 
Phosphatidylinositol 4,5-bisphosphate 3-kinase catalytic subunit gamma isoform
Name:Phosphatidylinositol 4,5-bisphosphate 3-kinase catalytic subunit gamma isoform
Type:Enzyme Subunit
Mol. Mass.:126470.30
Organism:Homo sapiens (Human)
Description:P48736
Residue:1102
BDBM50193017
NameBDBM50193017
Synonyms:CHEMBL3904942 | US11155556, No. 17
TypeSmall organic molecule
Emp. Form.C19H18N6O3S
Mol. Mass.410.45
SMILESCN1c2ccccc2C(=O)N(C)c2cnc(Nc3cccc(c3)S(N)(=O)=O)nc12