Reaction Details
TargetPhosphatidylinositol 4,5-bisphosphate 3-kinase catalytic subunit delta isoform
LigandBDBM50193015
Substrate/Competitorn/a
Meas. Tech.ChEBML_1614094
IC50 120±n/a nM
Citation Ferguson, FMNi, JZhang, TTesar, BSim, TKim, NDDeng, XBrown, JRZhao, JJGray, NS Discovery of a Series of 5,11-Dihydro-6 ACS Med Chem Lett7:908-912 (2016) 
 
Phosphatidylinositol 4,5-bisphosphate 3-kinase catalytic subunit delta isoform
Name:Phosphatidylinositol 4,5-bisphosphate 3-kinase catalytic subunit delta isoform
Type:Enzyme Subunit
Mol. Mass.:119489.41
Organism:Homo sapiens (Human)
Description:O00329
Residue:1044
BDBM50193015
NameBDBM50193015
Synonyms:CHEMBL3918001 | US11155556, No. 4
TypeSmall organic molecule
Emp. Form.C28H31N7O4S
Mol. Mass.561.655
SMILESCN1c2ccc(C)cc2C(=O)N(C)c2cnc(Nc3ccc(cc3)S(=O)(=O)N3CCC(CC3)NC(=O)C=C)nc12