Reaction Details
TargetPhosphatidylinositol 4,5-bisphosphate 3-kinase catalytic subunit gamma isoform
LigandBDBM150175
Substrate/Competitorn/a
Meas. Tech.ChEMBL_1614095 (CHEMBL3855895)
IC50 64±n/a nM
Citation Ferguson, FMNi, JZhang, TTesar, BSim, TKim, NDDeng, XBrown, JRZhao, JJGray, NS Discovery of a Series of 5,11-Dihydro-6 ACS Med Chem Lett7:908-912 (2016) 
 
Phosphatidylinositol 4,5-bisphosphate 3-kinase catalytic subunit gamma isoform
Name:Phosphatidylinositol 4,5-bisphosphate 3-kinase catalytic subunit gamma isoform
Type:Enzyme Subunit
Mol. Mass.:126470.30
Organism:Homo sapiens (Human)
Description:P48736
Residue:1102
BDBM150175
NameBDBM150175
Synonyms:US8980901, 107 | US9149477, Compound 107
TypeSmall organic molecule
Emp. Form.C22H18FN7O
Mol. Mass.415.423
SMILESCC[C@H](Nc1ncnc2[nH]cnc12)c1nc2cccc(F)c2c(=O)n1-c1ccccc1