Reaction Details
TargetPhosphatidylinositol 4,5-bisphosphate 3-kinase catalytic subunit gamma isoform
LigandBDBM50193027
Substrate/Competitorn/a
Meas. Tech.ChEMBL_1614095 (CHEMBL3855895)
IC50 340±n/a nM
Citation Ferguson, FMNi, JZhang, TTesar, BSim, TKim, NDDeng, XBrown, JRZhao, JJGray, NS Discovery of a Series of 5,11-Dihydro-6 ACS Med Chem Lett7:908-912 (2016) 
 
Phosphatidylinositol 4,5-bisphosphate 3-kinase catalytic subunit gamma isoform
Name:Phosphatidylinositol 4,5-bisphosphate 3-kinase catalytic subunit gamma isoform
Type:Enzyme Subunit
Mol. Mass.:126470.30
Organism:Homo sapiens (Human)
Description:P48736
Residue:1102
BDBM50193027
NameBDBM50193027
Synonyms:CHEMBL3935895 | US11155556, No. 8
TypeSmall organic molecule
Emp. Form.C29H27N7O4S
Mol. Mass.569.634
SMILESCN1c2ccc(C)cc2C(=O)N(C)c2cnc(Nc3ccc(cc3)S(=O)(=O)Nc3cccc(NC(=O)C=C)c3)nc12