Reaction Details
TargetAurora kinase B
LigandBDBM50193032
Substrate/Competitorn/a
Meas. Tech.ChEMBL_1614097 (CHEMBL3855897)
IC50 120±n/a nM
Citation Ferguson, FMNi, JZhang, TTesar, BSim, TKim, NDDeng, XBrown, JRZhao, JJGray, NS Discovery of a Series of 5,11-Dihydro-6 ACS Med Chem Lett7:908-912 (2016) 
 
Aurora kinase B
Name:Aurora kinase B
Type:Protein
Mol. Mass.:39327.72
Organism:Homo sapiens (Human)
Description:Q96GD4
Residue:344
BDBM50193032
NameBDBM50193032
Synonyms:CHEMBL3979343 | US11155556, No. 2
TypeSmall organic molecule
Emp. Form.C27H29N7O4S
Mol. Mass.547.629
SMILESCN1c2ccc(C)cc2C(=O)N(C)c2cnc(Nc3cccc(c3)S(=O)(=O)N3CCN(CC3)C(=O)C=C)nc12