Reaction Details
TargetBromodomain-containing protein 4
LigandBDBM50193014
Substrate/Competitorn/a
Meas. Tech.ChEMBL_1614102 (CHEMBL3855902)
IC50 18800±n/a nM
Citation Ferguson, FMNi, JZhang, TTesar, BSim, TKim, NDDeng, XBrown, JRZhao, JJGray, NS Discovery of a Series of 5,11-Dihydro-6 ACS Med Chem Lett7:908-912 (2016) 
 
Bromodomain-containing protein 4
Name:Bromodomain-containing protein 4
Type:Protein
Mol. Mass.:152264.84
Organism:Homo sapiens (Human)
Description:O60885
Residue:1362
BDBM50193014
NameBDBM50193014
Synonyms:CHEMBL3942643 | US11155556, No. 9
TypeSmall organic molecule
Emp. Form.C27H31N7O4S
Mol. Mass.549.645
SMILESCCC(=O)N1CCN(CC1)S(=O)(=O)c1cccc(Nc2ncc3N(C)C(=O)c4cc(C)ccc4N(C)c3n2)c1