Reaction Details
TargetPhosphatidylinositol 4,5-bisphosphate 3-kinase catalytic subunit delta isoform
LigandBDBM50193026
Substrate/Competitorn/a
Meas. Tech.ChEMBL_1614094 (CHEMBL3855894)
IC50 2600±n/a nM
Citation Ferguson, FMNi, JZhang, TTesar, BSim, TKim, NDDeng, XBrown, JRZhao, JJGray, NS Discovery of a Series of 5,11-Dihydro-6 ACS Med Chem Lett7:908-912 (2016) 
 
Phosphatidylinositol 4,5-bisphosphate 3-kinase catalytic subunit delta isoform
Name:Phosphatidylinositol 4,5-bisphosphate 3-kinase catalytic subunit delta isoform
Type:Enzyme Subunit
Mol. Mass.:119489.41
Organism:Homo sapiens (Human)
Description:O00329
Residue:1044
BDBM50193026
NameBDBM50193026
Synonyms:CHEMBL3948672 | US11155556, No. 11
TypeSmall organic molecule
Emp. Form.C25H29N7O3S
Mol. Mass.507.608
SMILESCN1CCN(CC1)S(=O)(=O)c1ccc(Nc2ncc3N(C)C(=O)c4cc(C)ccc4N(C)c3n2)cc1