Reaction Details
TargetNAD-dependent protein deacetylase sirtuin-1
LigandBDBM50438910
Substrate/Competitorn/a
Meas. Tech.ChEMBL_1614274 (CHEMBL3856343)
IC50 110±n/a nM
Citation Kumar, AChauhan, S How much successful are the medicinal chemists in modulation of SIRT1: A critical review. Eur J Med Chem119:45-69 (2016) 
 
NAD-dependent protein deacetylase sirtuin-1
Name:NAD-dependent protein deacetylase sirtuin-1
Type:Developmental protein; hydrolase
Mol. Mass.:81626.66
Organism:Homo sapiens (Human)
Description:n/a
Residue:747
BDBM50438910
NameBDBM50438910
Synonyms:CHEMBL1450796 | US9073941, 618
TypeSmall organic molecule
Emp. Form.C14H13N5O2
Mol. Mass.283.2853
SMILESCc1ccc(cc1)-c1nn(C)c2nc(=O)n(C)c(=O)c2n1