Reaction Details
TargetCyclin-dependent kinase 2
LigandBDBM50229973
Substrate/Competitorn/a
Meas. Tech.ChEMBL_1614478 (CHEMBL3856547)
Ki 2.0±n/a nM
Citation Sonawane, YATaylor, MANapoleon, JVRana, SContreras, JINatarajan, A Cyclin Dependent Kinase 9 Inhibitors for Cancer Therapy. J Med Chem59:8667-8684 (2016) 
 
Cyclin-dependent kinase 2
Name:Cyclin-dependent kinase 2
Type:Enzyme Subunit
Mol. Mass.:33938.17
Organism:Homo sapiens (Human)
Description:P24941
Residue:298
BDBM50229973
NameBDBM50229973
Synonyms:(4-(2-Amino-4-methylthiazol-5-yl)pyrimidin-2-yl)-(3-nitrophenyl)amine CHEMBL298445 | [4-(2-AMINO-4-METHYL-THIAZOL-5-YL)-PYRIMIDIN-2-YL]-(3-NITRO-PHENYL)-AMINE
TypeSmall organic molecule
Emp. Form.C14H12N6O2S
Mol. Mass.328.349
SMILESCc1nc(N)sc1-c1ccnc(Nc2cccc(c2)[N+]([O-])=O)n1