Reaction Details
TargetCyclin-dependent kinase 7
LigandBDBM81441
Substrate/Competitorn/a
Meas. Tech.ChEMBL_1614433 (CHEMBL3856502)
Ki 2.3±n/a nM
Citation Sonawane, YATaylor, MANapoleon, JVRana, SContreras, JINatarajan, A Cyclin Dependent Kinase 9 Inhibitors for Cancer Therapy. J Med Chem59:8667-8684 (2016) 
 
Cyclin-dependent kinase 7
Name:Cyclin-dependent kinase 7
Type:Enzyme Subunit
Mol. Mass.:39047.01
Organism:Homo sapiens (Human)
Description:n/a
Residue:346
BDBM81441
NameBDBM81441
Synonyms:CDK Inhibitor, 14
TypeSmall organic molecule
Emp. Form.C19H22N6OS
Mol. Mass.382.483
SMILESCc1c(sc(=O)n1C)-c1ccnc(Nc2ccc(cc2)N2CCNCC2)n1