Reaction Details
TargetAcetylcholinesterase
LigandBDBM8960
Substrate/Competitorn/a
Meas. Tech.ChEMBL_1614944 (CHEMBL3857013)
IC50 38±n/a nM
Citation Kumar, JMeena, PSingh, AJameel, EMaqbool, MMobashir, MShandilya, ATiwari, MHoda, NJayaram, B Synthesis and screening of triazolopyrimidine scaffold as multi-functional agents for Alzheimer's disease therapies. Eur J Med Chem119:260-77 (2016) 
 
Acetylcholinesterase
Name:Acetylcholinesterase
Type:Enzyme
Mol. Mass.:71812.79
Organism:Electrophorus electricus (Electric eel)
Description:n/a
Residue:633
BDBM8960
NameBDBM8960
Synonyms:(+/-)-2-[(1-benzylpiperidin-4-yl)methyl]-5,6-dimethoxy-indan-1-one Aricept CHEMBL1678 CHEMBL502 Donepezil E2020 US9346818, DPH US9663465, Donepezil
TypeSmall organic molecule
Emp. Form.C24H29NO3
Mol. Mass.379.492
SMILESCOc1cc2CC(CC3CCN(Cc4ccccc4)CC3)C(=O)c2cc1OC