Reaction Details
TargetEstrogen-related receptor gamma
LigandBDBM50193253
Substrate/Competitorn/a
Meas. Tech.ChEMBL_1615023 (CHEMBL3857092)
IC50 48±n/a nM
Citation Kim, JChin, JIm, CYYoo, EKWoo, SHwang, HJCho, JHSeo, KASong, JHwang, HKim, KHKim, NDYoon, SKJeon, JHYoon, SYJeon, YHChoi, HSLee, IKKim, SHCho, SJ Synthesis and biological evaluation of novel 4-hydroxytamoxifen analogs as estrogen-related receptor gamma inverse agonists. Eur J Med Chem120:338-52 (2016) 
 
Estrogen-related receptor gamma
Name:Estrogen-related receptor gamma
Type:PROTEIN
Mol. Mass.:51305.00
Organism:Homo sapiens (Human)
Description:ChEMBL_1501351
Residue:458
BDBM50193253
NameBDBM50193253
Synonyms:CHEMBL3961676
TypeSmall organic molecule
Emp. Form.C27H31ClFNO2
Mol. Mass.455.992
SMILESCl.CN(C)CCOc1ccc(cc1)C(=C(\CCCF)c1ccccc1)\c1ccc(O)cc1