Reaction Details
TargetCannabinoid receptor 2
LigandBDBM50193281
Substrate/Competitorn/a
Meas. Tech.ChEBML_1615641
Ki 24±n/a nM
Citation Lazzari, PDistinto, RManca, IBaillie, GMurineddu, GPira, MFalzoi, MSani, MMorales, PRoss, RZanda, MJagerovic, NPinna, GA A critical review of both the synthesis approach and the receptor profile of the 8-chloro-1-(2',4'-dichlorophenyl)-N-piperidin-1-yl-1,4,5,6-tetrahydrobenzo[6,7]cyclohepta[1,2-c]pyrazole-3-carboxamide and analogue derivatives. Eur J Med Chem121:194-208 (2016) 
 
Cannabinoid receptor 2
Name:Cannabinoid receptor 2
Type:G Protein-Coupled Receptor (GPCR)
Mol. Mass.:39690.94
Organism:Homo sapiens (Human)
Description:P34972
Residue:360
BDBM50193281
NameBDBM50193281
Synonyms:CHEMBL3927357
TypeSmall organic molecule
Emp. Form.C26H27Cl3N2O
Mol. Mass.489.864
SMILESOC(CC1CCCCC1)c1nn(c-2c1CCCc1cc(Cl)ccc-21)-c1ccc(Cl)cc1Cl