Reaction Details
Target3-hydroxy-3-methylglutaryl-coenzyme A reductase
LigandBDBM50193396
Substrate/Competitorn/a
Meas. Tech.ChEMBL_1615877 (CHEMBL3857946)
IC50 19±n/a nM
Citation Talele, TT The"Cyclopropyl Fragment" is a Versatile Player that Frequently Appears in Preclinical/Clinical Drug Molecules. J Med Chem59:8712-8756 (2016) 
 
3-hydroxy-3-methylglutaryl-coenzyme A reductase
Name:3-hydroxy-3-methylglutaryl-coenzyme A reductase
Type:Enzyme
Mol. Mass.:96689.85
Organism:Rattus norvegicus (rat)
Description:Isolated rat liver microsomes were used as enzyme source.
Residue:887
BDBM50193396
NameBDBM50193396
Synonyms:CHEMBL3951152
TypeSmall organic molecule
Emp. Form.C25H26FNO4
Mol. Mass.423.4766
SMILESCC(C)c1nc2ccccc2c(-c2ccc(F)cc2)c1\C=C\[C@@H](O)C[C@@H](O)CC(O)=O