Reaction Details
TargetHistone-lysine N-methyltransferase EZH2
LigandBDBM50193709
Substrate/Competitorn/a
Meas. Tech.ChEMBL_1615982 (CHEMBL3858051)
IC50 15±n/a nM
Citation Kung, PPRui, EBergqvist, SBingham, PBraganza, JCollins, MCui, MDiehl, WDinh, DFan, CFantin, VRGukasyan, HJHu, WHuang, BKephart, SKrivacic, CKumpf, RALi, GMaegley, KAMcAlpine, INguyen, LNinkovic, SOrnelas, MRyskin, MScales, SSutton, STatlock, JVerhelle, DWang, FWells, PWythes, MYamazaki, SYip, BYu, XZehnder, LZhang, WGRollins, RAEdwards, M Design and Synthesis of Pyridone-Containing 3,4-Dihydroisoquinoline-1(2H)-ones as a Novel Class of Enhancer of Zeste Homolog 2 (EZH2) Inhibitors. J Med Chem59:8306-25 (2016) 
 
Histone-lysine N-methyltransferase EZH2
Name:Histone-lysine N-methyltransferase EZH2
Type:Protein
Mol. Mass.:85367.84
Organism:Homo sapiens (Human)
Description:Q15910
Residue:746
BDBM50193709
NameBDBM50193709
Synonyms:CHEMBL3911017
TypeSmall organic molecule
Emp. Form.C22H21Cl2N3O3
Mol. Mass.446.326
SMILESCc1noc(C)c1-c1cc(Cl)c2CCN(Cc3c(C)cc(C)[nH]c3=O)C(=O)c2c1Cl