Reaction Details
TargetPotassium voltage-gated channel subfamily H member 2
LigandBDBM50389154
Substrate/Competitorn/a
Meas. Tech.ChEMBL_1616176 (CHEMBL3858245)
IC50>10000±n/a nM
Citation Ott, GRCheng, MLearn, KSWagner, JGingrich, DELisko, JGCurry, MMesaros, EFGhose, AKQuail, MRWan, WLu, LDobrzanski, PAlbom, MSAngeles, TSWells-Knecht, KHuang, ZAimone, LDBruckheimer, EAnderson, NFriedman, JFernandez, SVAtor, MARuggeri, BADorsey, BD Discovery of Clinical Candidate CEP-37440, a Selective Inhibitor of Focal Adhesion Kinase (FAK) and Anaplastic Lymphoma Kinase (ALK). J Med Chem59:7478-96 (2016) 
 
Potassium voltage-gated channel subfamily H member 2
Name:Potassium voltage-gated channel subfamily H member 2
Type:Multi-pass membrane protein
Mol. Mass.:126672.65
Organism:Homo sapiens (Human)
Description:Q12809
Residue:1159
BDBM50389154
NameBDBM50389154
Synonyms:CHEMBL2064666
TypeSmall organic molecule
Emp. Form.C28H35ClN6O3
Mol. Mass.539.069
SMILESCOc1c(Nc2ncc(Cl)c(N[C@@H]3[C@@H]4C[C@@H](C=C4)[C@@H]3C(N)=O)n2)ccc2CC[C@@H](CCc12)N1CCOCC1