Reaction Details
TargetInsulin receptor
LigandBDBM50193816
Substrate/Competitorn/a
Meas. Tech.ChEMBL_1616171 (CHEMBL3858240)
IC50 1301±n/a nM
Citation Ott, GRCheng, MLearn, KSWagner, JGingrich, DELisko, JGCurry, MMesaros, EFGhose, AKQuail, MRWan, WLu, LDobrzanski, PAlbom, MSAngeles, TSWells-Knecht, KHuang, ZAimone, LDBruckheimer, EAnderson, NFriedman, JFernandez, SVAtor, MARuggeri, BADorsey, BD Discovery of Clinical Candidate CEP-37440, a Selective Inhibitor of Focal Adhesion Kinase (FAK) and Anaplastic Lymphoma Kinase (ALK). J Med Chem59:7478-96 (2016) 
 
Insulin receptor
Name:Insulin receptor
Type:Receptor Tyrosine Kinase
Mol. Mass.:156322.60
Organism:Homo sapiens (Human)
Description:P06213
Residue:1382
BDBM50193816
NameBDBM50193816
Synonyms:CHEMBL3951972
TypeSmall organic molecule
Emp. Form.C27H35ClN6O3
Mol. Mass.527.058
SMILES[H][C@@]12C[C@@]([H])(C=C1)[C@@H]([C@@H]2Nc1nc(Nc2ccc3CC(CCCc3c2OC)NCCOC)ncc1Cl)C(N)=O