Reaction Details
TargetALK tyrosine kinase receptor
LigandBDBM50193820
Substrate/Competitorn/a
Meas. Tech.ChEMBL_1616170 (CHEMBL3858239)
IC50 44±n/a nM
Citation Ott, GRCheng, MLearn, KSWagner, JGingrich, DELisko, JGCurry, MMesaros, EFGhose, AKQuail, MRWan, WLu, LDobrzanski, PAlbom, MSAngeles, TSWells-Knecht, KHuang, ZAimone, LDBruckheimer, EAnderson, NFriedman, JFernandez, SVAtor, MARuggeri, BADorsey, BD Discovery of Clinical Candidate CEP-37440, a Selective Inhibitor of Focal Adhesion Kinase (FAK) and Anaplastic Lymphoma Kinase (ALK). J Med Chem59:7478-96 (2016) 
 
ALK tyrosine kinase receptor
Name:ALK tyrosine kinase receptor
Type:Protein
Mol. Mass.:176453.10
Organism:Homo sapiens (Human)
Description:Q9UM73
Residue:1620
BDBM50193820
NameBDBM50193820
Synonyms:CHEMBL3943066
TypeSmall organic molecule
Emp. Form.C29H37ClN6O3
Mol. Mass.553.095
SMILESCOc1ccccc1Nc1nc(Nc2ccc3CC(CCCc3c2OC)N2CCN(CCO)CC2)ncc1Cl