Reaction Details
TargetFocal adhesion kinase 1
LigandBDBM50193824
Substrate/Competitorn/a
Meas. Tech.ChEMBL_1616175 (CHEMBL3858244)
IC50 4.0±n/a nM
Citation Ott, GRCheng, MLearn, KSWagner, JGingrich, DELisko, JGCurry, MMesaros, EFGhose, AKQuail, MRWan, WLu, LDobrzanski, PAlbom, MSAngeles, TSWells-Knecht, KHuang, ZAimone, LDBruckheimer, EAnderson, NFriedman, JFernandez, SVAtor, MARuggeri, BADorsey, BD Discovery of Clinical Candidate CEP-37440, a Selective Inhibitor of Focal Adhesion Kinase (FAK) and Anaplastic Lymphoma Kinase (ALK). J Med Chem59:7478-96 (2016) 
 
Focal adhesion kinase 1
Name:Focal adhesion kinase 1
Type:Tyrosine-protein kinase
Mol. Mass.:119233.17
Organism:Homo sapiens (Human)
Description:Q05397
Residue:1052
BDBM50193824
NameBDBM50193824
Synonyms:CHEMBL3961598
TypeSmall organic molecule
Emp. Form.C32H39ClN8O2
Mol. Mass.603.157
SMILESCOc1c(Nc2ncc(Cl)c(Nc3ccccc3-c3nccn3C)n2)ccc2CC(CCCc12)N1CCN(CCO)CC1