Reaction Details
TargetALK tyrosine kinase receptor
LigandBDBM50193818
Substrate/Competitorn/a
Meas. Tech.ChEMBL_1616174 (CHEMBL3858243)
IC50 60±n/a nM
Citation Ott, GRCheng, MLearn, KSWagner, JGingrich, DELisko, JGCurry, MMesaros, EFGhose, AKQuail, MRWan, WLu, LDobrzanski, PAlbom, MSAngeles, TSWells-Knecht, KHuang, ZAimone, LDBruckheimer, EAnderson, NFriedman, JFernandez, SVAtor, MARuggeri, BADorsey, BD Discovery of Clinical Candidate CEP-37440, a Selective Inhibitor of Focal Adhesion Kinase (FAK) and Anaplastic Lymphoma Kinase (ALK). J Med Chem59:7478-96 (2016) 
 
ALK tyrosine kinase receptor
Name:ALK tyrosine kinase receptor
Type:Protein
Mol. Mass.:176453.10
Organism:Homo sapiens (Human)
Description:Q9UM73
Residue:1620
BDBM50193818
NameBDBM50193818
Synonyms:CHEMBL3925372
TypeSmall organic molecule
Emp. Form.C31H40ClN7O4S
Mol. Mass.642.212
SMILESCOc1c(Nc2ncc(Cl)c(Nc3ccccc3N3CCCS3(=O)=O)n2)ccc2CC(CCCc12)N1CCN(CCO)CC1