Reaction Details
TargetFocal adhesion kinase 1
LigandBDBM50193825
Substrate/Competitorn/a
Meas. Tech.ChEMBL_1616175 (CHEMBL3858244)
IC50 9.3±n/a nM
Citation Ott, GRCheng, MLearn, KSWagner, JGingrich, DELisko, JGCurry, MMesaros, EFGhose, AKQuail, MRWan, WLu, LDobrzanski, PAlbom, MSAngeles, TSWells-Knecht, KHuang, ZAimone, LDBruckheimer, EAnderson, NFriedman, JFernandez, SVAtor, MARuggeri, BADorsey, BD Discovery of Clinical Candidate CEP-37440, a Selective Inhibitor of Focal Adhesion Kinase (FAK) and Anaplastic Lymphoma Kinase (ALK). J Med Chem59:7478-96 (2016) 
 
Focal adhesion kinase 1
Name:Focal adhesion kinase 1
Type:Tyrosine-protein kinase
Mol. Mass.:119233.17
Organism:Homo sapiens (Human)
Description:Q05397
Residue:1052
BDBM50193825
NameBDBM50193825
Synonyms:CHEMBL3953048
TypeSmall organic molecule
Emp. Form.C29H38ClN7O4S
Mol. Mass.616.175
SMILESCOc1c(Nc2ncc(Cl)c(Nc3ccccc3NS(C)(=O)=O)n2)ccc2CC(CCCc12)N1CCN(CCO)CC1